{"text_format":"1","workbook":"xlsx","n_sheets":15,"sheets":["Instructions","Lookup","DataEntry","StockSolutionsHELP","Calculate","JarG","Neat chemical help","Calibrate Data","JarSettingsHELP","HydraulicMixHELP","NozzleMixHELP","TurbineMixHELP","PaddleMixHELP","BeamMixHELP","Database"],"not_rendered":{"charts":14,"images":9,"macros":1,"external_links":0,"defined_names":48,"comments":10,"pivot_tables":0},"unopened":[],"bounds":{"document_bytes":16777216,"sheet_cells":100000,"rows_first":2000,"rows_last":500,"rows_between":2000,"halvings":0,"cell_chars":16384,"cell_head_chars":4096},"cells_cut":0,"cells_raw":0,"read":"whole","date_system":"1900"}

{"sheet":"Instructions","index":0,"n_rows":60,"n_cols":3,"rows_kept":60,"cut":false,"hidden":false,"merged":[]}
["Jar Test Program"]
["Instructions"]
["Enter Data:"]
["  Enter jar test data into the DataEntry worksheet."]
["  The StockSolutionHELP worksheet provides information on making stock solutions."]
["  The JarSettingsHELP worksheet provides information on setting mixing speeds and settling times."]
["  The results from individual jar tests can be saved to the Database worksheet by clicking on the Updata Database Button"]
["    found in the DataEntry worksheet."]
["  Results from a previous jar test can be retrieved from the database by inputting the jar test date and number and clicking"]
["    on the Retrieve Button found in the DataEntry worksheet."]
{"$rows_left_out":51}
{"sheet":"Lookup","index":1,"n_rows":53,"n_cols":9,"rows_kept":53,"cut":false,"hidden":true,"merged":[]}
[null,{"$f":"\"Jar Test Summary for \"&B4&\" WTP\"","v":{"$error":"#N/A"}}]
[null,"Step 1 - Enter plant background data.  Enter data in cells with white background only."]
[null,"Plant/Train Name","Date","Test No.","Test Time, hr:min",null,"Test Date",null,"Warning:  Do not enter data"]
[null,{"$f":"VLOOKUP(Lookup!$D$49,DatabaseJar,Database!C5)","v":{"$error":"#N/A"}},{"$f":"VLOOKUP(Lookup!$D$49,DatabaseJar,Database!B5)","v":{"$error":"#N/A"}},{"$f":"VLOOKUP(Lookup!$D$49,DatabaseJar,Database!E5)","v":{"$error":"#N/A"}},{"$f":"VLOOKUP(Lookup!$D$49,DatabaseJar,Database!F5)","v":{"$error":"#N/A"}},null,"Test No.",null,"  in this screen.  It is used to"]
[null,"Water Source","Flow Rate (MGD)","Raw Turbidity","Water Temp (C)","Raw pH","Raw Alk. (mg/L)","Raw TOC (mg/L)","  retrieve data from the database."]
[null,{"$f":"VLOOKUP(Lookup!$D$49,DatabaseJar,Database!D5)","v":{"$error":"#N/A"}},{"$f":"VLOOKUP(Lookup!$D$49,DatabaseJar,Database!I5)","v":{"$error":"#N/A"}},{"$f":"VLOOKUP(Lookup!$D$49,DatabaseJar,Database!G5)","v":{"$error":"#N/A"}},{"$f":"VLOOKUP(Lookup!$D$49,DatabaseJar,Database!H5)","v":{"$error":"#N/A"}},{"$f":"VLOOKUP(Lookup!$D$49,DatabaseJar,Database!J5)","v":{"$error":"#N/A"}},{"$f":"VLOOKUP(Lookup!$D$49,DatabaseJar,Database!L5)","v":{"$error":"#N/A"}},{"$f":"VLOOKUP(Lookup!$D$49,DatabaseJar,Database!K5)","v":{"$error":"#N/A"}}]
[null,"Chemical","Coagulant","Other Chemical 1","Other Chemical 2","Settled Turbidity","IFE Turbidity","Treated TOC (mg/L)"]
[null,"Name",{"$f":"VLOOKUP(Lookup!$D$49,DatabaseJar,Database!M5)","v":{"$error":"#N/A"}},{"$f":"VLOOKUP(Lookup!$D$49,DatabaseJar,Database!O5)","v":{"$error":"#N/A"}},{"$f":"VLOOKUP(Lookup!$D$49,DatabaseJar,Database!Q5)","v":{"$error":"#N/A"}},{"$f":"VLOOKUP(Lookup!$D$49,DatabaseJar,Database!S5)","v":{"$error":"#N/A"}},{"$f":"VLOOKUP(Lookup!$D$49,DatabaseJar,Database!T5)","v":{"$error":"#N/A"}},{"$f":"VLOOKUP(Lookup!$D$49,DatabaseJar,Database!U5)","v":{"$error":"#N/A"}}]
[null,"Current Dose",{"$f":"VLOOKUP(Lookup!$D$49,DatabaseJar,Database!$N$5)","v":{"$error":"#N/A"}},{"$f":"VLOOKUP(Lookup!$D$49,DatabaseJar,Database!$P$5)","v":{"$error":"#N/A"}},{"$f":"VLOOKUP(Lookup!$D$49,DatabaseJar,Database!$R$5)","v":{"$error":"#N/A"}}]
[]
{"$rows_left_out":44}
{"sheet":"DataEntry","index":2,"n_rows":44,"n_cols":10,"rows_kept":44,"cut":false,"hidden":false,"merged":[]}
[null,{"$f":"\"Jar Test Summary for \"&B4&\" WTP\"","v":"Jar Test Summary for  WTP"}]
[null,"Step 1 - Enter plant background data.  Enter data in cells with white background only"]
[null,"Plant/Train Name","Date","Test No.","Test Time, hr:min",null,"Test Date"]
[null,null,null,null,null,null,"Test No."]
[null,"Water Source","Flow Rate (MGD)","Raw Turbidity","Water Temp (C)","Raw pH","Raw Alk. (mg/L)","Raw TOC (mg/L)"]
[]
[null,"Chemical","Coagulant","Other Chemical 1","Other Chemical 2","Settled Turbidity","IFE Turbidity","Treated TOC (mg/L)"]
[null,"Name"]
[null,"Current Dose"]
[]
{"$rows_left_out":35}
{"sheet":"StockSolutionsHELP","index":3,"n_rows":64,"n_cols":7,"rows_kept":64,"cut":false,"hidden":false,"merged":[[1,1,1,7],[58,5,58,6],[51,5,51,6],[52,5,52,6],[47,5,47,6],[46,5,46,6],[40,5,40,6],[41,5,41,6],[37,2,37,6],[38,5,38,6],[59,5,59,6],[60,5,60,6],[12,4,12,5],[54,5,54,6],[57,5,57,6],[39,5,39,6],[53,5,53,6]]}
[]
[null,"Stock Solution HELP Screen"]
[null,"The goal of this guideline is to help you \"Prepare a Stock Solution\""]
[null,"Table 1:  Determining the concentration of the stock solutions"]
[null,null,"To use Table 1, FIRST determine how much raw water you will be adding to each jar.  For example, if you are using 2,000 mL jars and conducting a"]
[null,null,"conventional jar test, you will typically be adding 2,000 mL to each jar.  SECOND, consider the chemical dosages that are to be added to each jar."]
[null,null,"For example, you may want the alum dosage to increase by 10 mg/L in each jar.  THIRD, identify the stock solution concentration (%) that you need"]
[null,null,"to prepare and transfer this information to Table 3 below."]
[]
[null,null,"Table 1"]
{"$rows_left_out":55}
{"sheet":"Calculate","index":4,"n_rows":6,"n_cols":97,"rows_kept":6,"cut":false,"hidden":true,"merged":[]}
[null,null,null,null,null,null,null,null,null,null,null,null,null,"Current","Other","Current Dose","Other","Current Dose",null,null,null,"Rapid Mix","Rapid Mix","Rapid Mix","Rapid Mix","Floc","Floc","Floc","Floc","Floc","Floc",null,"Stock Solution Concentration",null,null,"Raw Water","Jar 1","Jar 1","Jar 1","Jar 1","Jar 1","Jar 1","Jar 1","Jar 1","Jar 1","Jar 1","Jar 2","Jar 2","Jar 2","Jar 2","Jar 2","Jar 2","Jar 2","Jar 2","Jar 2","Jar 2","Jar 3","Jar 3","Jar 3","Jar 3","Jar 3","Jar 3","Jar 3","Jar 3","Jar 3","Jar 3","Jar 4","Jar 4","Jar 4","Jar 4","Jar 4","Jar 4","Jar 4","Jar 4","Jar 4","Jar 4","Jar 5","Jar 5","Jar 5","Jar 5","Jar 5","Jar 5","Jar 5","Jar 5","Jar 5","Jar 5","Jar 6","Jar 6","Jar 6","Jar 6","Jar 6","Jar 6","Jar 6","Jar 6","Jar 6","Jar 6"]
["Date &",null,"Plant/Train","Water","Test","Test","Raw","Water","Water","Raw","Raw","Raw","Coagulant","Dose","Chemical 1","Other","Chemical 2","Other","Settled","IFE","Finished","Speed","Speed","Speed","Speed","Stage 1","Stage 1","Stage 2","Stage 2","Stage 3","Stage 3","Settle","Coagulant","Other","Other","Added to","Coagulant","Other Chem 1","Other Chem 2","Time to Floc","Floc","Settled","Settled","Filtered","Settled","Settled","Coagulant","Other Chem 1","Other Chem 2","Time to Floc","Floc","Settled","Settled","Filtered","Settled","Settled","Coagulant","Other Chem 1","Other Chem 2","Time to Floc","Floc","Settled","Settled","Filtered","Settled","Settled","Coagulant","Other Chem 1","Other Chem 2","Time to Floc","Floc","Settled","Settled","Filtered","Settled","Settled","Coagulant","Other Chem 1","Other Chem 2","Time to Floc","Floc","Settled","Settled","Filtered","Settled","Settled","Coagulant","Other Chem 1","Other Chem 2","Time to","Floc","Settled","Settled","Filtered","Settled","Settled","Last"]
["Sample No.","Date","Name","Source","No.","Time","Turbidity","Temperature","Flow","pH","TOC","Alkalinity","Name","Coagulant","Name","Chemical 1","Name","Chemical 2","Turbidity","Turbidity","TOC","#1","#1","#2","#2","Speed","Time","Speed","Time","Speed","Time","Time",null,"Chemical 1","Chemical 2","Jars","Dose","Dose","Dose","Formation","Size","Turb","pH","Turb","TOC","UV absorb","Dose","Dose","Dose","Formation","Size","Turb","pH","Turb","TOC","UV absorb","Dose","Dose","Dose","Formation","Size","Turb","pH","Turb","TOC","UV absorb","Dose","Dose","Dose","Formation","Size","Turb","pH","Turb","TOC","UV absorb","Dose","Dose","Dose","Formation","Size","Turb","pH","Turb","TOC","UV absorb","Dose","Dose","Dose","Floc","Size","Turb","pH","Turb","TOC","UV absorb","Column"]
["#","m/d/y",null,null,"#","hr:min","NTU","C","MGD","units","mg/L","mg/L",null,null,null,null,null,null,null,null,null,"RPM","min","RPM","min","RPM","min","RPM","min","RPM","min","min","%","%","%","mL","mg/L","mg/L","mg/L","min","mm","NTU","units","NTU","mg/L","cm-1","mg/L","mg/L","mg/L","min","mm","NTU","units","NTU","mg/L","cm-1","mg/L","mg/L","mg/L","min","mm","NTU","units","NTU","mg/L","cm-1","mg/L","mg/L","mg/L","min","mm","NTU","units","NTU","mg/L","cm-1","mg/L","mg/L","mg/L","min","mm","NTU","units","NTU","mg/L","cm-1","mg/L","mg/L","mg/L","min","mm","NTU","units","NTU","mg/L","cm-1"]
[1,2,3,4,5,6,7,8,9,10,11,12,13,14,15,16,17,18,19,20,21,22,23,24,25,26,27,28,29,30,31,32,33,34,35,36,37,38,39,40,41,42,43,44,45,46,47,48,49,50,51,52,53,54,55,56,57,58,59,60,61,62,63,64,65,66,67,68,69,70,71,72,73,74,75,76,77,78,79,80,81,82,83,84,85,86,87,88,89,90,91,92,93,94,95,96,97]
[{"$f":"ROUND(B6+E6/100,2)","v":0},{"$f":"DataEntry!C4","v":"00:00:00"},{"$f":"DataEntry!B4","v":0},{"$f":"DataEntry!B6","v":0},{"$f":"DataEntry!$D$4","v":0},{"$f":"DataEntry!E4","v":"00:00:00"},{"$f":"DataEntry!D6","v":0},{"$f":"DataEntry!E6","v":0},{"$f":"DataEntry!C6","v":0},{"$f":"DataEntry!F6","v":0},{"$f":"DataEntry!H6","v":0},{"$f":"DataEntry!G6","v":0},{"$f":"DataEntry!C8","v":0},{"$f":"DataEntry!C9","v":0},{"$f":"DataEntry!D8","v":0},{"$f":"DataEntry!D9","v":0},{"$f":"DataEntry!E8","v":0},{"$f":"DataEntry!E9","v":0},{"$f":"DataEntry!F8","v":0},{"$f":"DataEntry!G8","v":0},{"$f":"DataEntry!H8","v":0},{"$f":"DataEntry!C13","v":0},{"$f":"DataEntry!C14","v":0},{"$f":"DataEntry!D13","v":0},{"$f":"DataEntry!D14","v":0},{"$f":"DataEntry!E13","v":0},{"$f":"DataEntry!E14","v":0},{"$f":"DataEntry!F13","v":0},{"$f":"DataEntry!F14","v":0},{"$f":"DataEntry!G13","v":0},{"$f":"DataEntry!G14","v":0},{"$f":"DataEntry!H14","v":0},{"$f":"DataEntry!C21","v":0},{"$f":"DataEntry!D21","v":0},{"$f":"DataEntry!E21","v":0},{"$f":"DataEntry!F21","v":0},{"$f":"DataEntry!C23","v":0},{"$f":"DataEntry!C26","v":0},{"$f":"DataEntry!C29","v":0},{"$f":"DataEntry!C37","v":0},{"$f":"DataEntry!C38","v":0},{"$f":"DataEntry!C39","v":0},{"$f":"DataEntry!C40","v":0},{"$f":"DataEntry!C41","v":0},{"$f":"DataEntry!C42","v":0},{"$f":"DataEntry!C43","v":0},{"$f":"DataEntry!D23","v":0},{"$f":"DataEntry!D26","v":0},{"$f":"DataEntry!D29","v":0},{"$f":"DataEntry!D37","v":0},{"$f":"DataEntry!D38","v":0},{"$f":"DataEntry!D39","v":0},{"$f":"DataEntry!D40","v":0},{"$f":"DataEntry!D41","v":0},{"$f":"DataEntry!D42","v":0},{"$f":"DataEntry!D43","v":0},{"$f":"DataEntry!E23","v":0},{"$f":"DataEntry!E26","v":0},{"$f":"DataEntry!D29","v":0},{"$f":"DataEntry!E37","v":0},{"$f":"DataEntry!E38","v":0},{"$f":"DataEntry!E39","v":0},{"$f":"DataEntry!E40","v":0},{"$f":"DataEntry!E41","v":0},{"$f":"DataEntry!E42","v":0},{"$f":"DataEntry!E43","v":0},{"$f":"DataEntry!F23","v":0},{"$f":"DataEntry!F26","v":0},{"$f":"DataEntry!F29","v":0},{"$f":"DataEntry!F37","v":0},{"$f":"DataEntry!F38","v":0},{"$f":"DataEntry!F39","v":0},{"$f":"DataEntry!F40","v":0},{"$f":"DataEntry!F41","v":0},{"$f":"DataEntry!F42","v":0},{"$f":"DataEntry!F43","v":0},{"$f":"DataEntry!G23","v":0},{"$f":"DataEntry!G26","v":0},{"$f":"DataEntry!G29","v":0},{"$f":"DataEntry!G37","v":0},{"$f":"DataEntry!G38","v":0},{"$f":"DataEntry!G39","v":0},{"$f":"DataEntry!G40","v":0},{"$f":"DataEntry!G41","v":0},{"$f":"DataEntry!G42","v":0},{"$f":"DataEntry!G43","v":0},{"$f":"DataEntry!H23","v":0},{"$f":"DataEntry!H26","v":0},{"$f":"DataEntry!H29","v":0},{"$f":"DataEntry!H37","v":0},{"$f":"DataEntry!H38","v":0},{"$f":"DataEntry!H39","v":0},{"$f":"DataEntry!H40","v":0},{"$f":"DataEntry!H41","v":0},{"$f":"DataEntry!H42","v":0},{"$f":"DataEntry!H43","v":0}]

{"sheet":"JarG","index":5,"n_rows":34,"n_cols":19,"rows_kept":34,"cut":false,"hidden":true,"merged":[[16,2,16,8],[16,12,16,18]]}
[]
[null,"G calculations for jar testing"]
[null,null,null,"Impller: 1 inch x 3 inch (25.4 mm x 76 mm)",null,null,null,{"$f":"25.4*76","v":1930.3999999999999},null,null,null,null,null,null,"Impeller: 40 mm x 60 mm",null,null,{"$f":"40*60","v":2400}]
[null,"Input 2 liter jar:",null,null,null,null,null,null,null,null,null,null,"Input 1 liter jar based on EC Engineering design and mixing curve."]
["Diameter","D",{"$f":"7.5/2.54/12","v":0.24606299212598426},"ft",null,null,null,null,null,null,null,"Diameter","D",{"$f":"7.7/2.54/12","v":0.25262467191601051},"ft","7.7 cm versus 6 cm to match vendor curve"]
[null,"Np",3,"FBT","Adjusted from recommended value of 3.6 for flat blade turbine to fit original curve",null,null,null,null,null,null,null,"Np",3,"FBT"]
["Specific gravity","S",1,null,null,null,null,null,null,null,null,"Specific gravity","S",1]
["Volume","V",{"$f":"2/3.785/7.48","v":7.0641923155715977E-2},"ft3",null,null,null,null,null,null,null,"Volume","V",{"$f":"1/3.785/7.48","v":3.5320961577857989E-2},"ft3"]
["Viscosity","u",3.7459999999999997E-5,"lb-sec/ft2 @ 0C",null,null,null,null,null,null,null,null,"u",3.7459999999999997E-5,"lb-sec/ft2 @ 0C"]
[null,"u",{"$f":"0.00003229","v":3.2289999999999997E-5},"lb-sec/ft2 @ 4C",null,null,null,null,null,null,null,null,"u",{"$f":"0.00003229","v":3.2289999999999997E-5},"lb-sec/ft2 @ 4C"]
{"$rows_left_out":25}
{"sheet":"Neat chemical help","index":6,"n_rows":16,"n_cols":8,"rows_kept":16,"cut":false,"hidden":false,"merged":[[5,2,5,3],[6,2,6,3]]}
[null,"Help Page for Determining How many uLs of neat chemical to add to jars"]
[]
[null,"Note:  all cells are protected except the yellow cells for data entry."]
[]
[]
[null,"Product Strengh (lb/gal)",5.4]
[null,"Volume of Jar (L)",2]
[]
[]
[null,null,"Desired dosage (mg/L) Jar 1","Desired dosage (mg/L) Jar 2","Desired dosage (mg/L) Jar 3","Desired dosage (mg/L) Jar 4","Desired dosage (mg/L) Jar 5","Desired dosage (mg/L) Jar 6"]
{"$rows_left_out":7}
{"sheet":"Calibrate Data","index":7,"n_rows":63,"n_cols":6,"rows_kept":63,"cut":false,"hidden":false,"merged":[]}
[null,"Jar Test Calibration Parameters"]
[null,"Chemicals added at Rapid Mix"]
[null,"Parameter","Chemical 1","Chemical 2","Chemical 3","Chemical 4"]
[null,"Liquid (description)","Aqua Hawk 457 (Hawkins product)"]
[null,"  Specific gravity","1.15 - 1.28"]
[null,"  Product strength, %",100]
[null,"  Product strength, lb/gal"]
[null,"Dry (description)"]
[null,"  Product purity, %"]
[null,"Comments/Notes:"]
{"$rows_left_out":54}
{"sheet":"JarSettingsHELP","index":8,"n_rows":92,"n_cols":19,"rows_kept":92,"cut":false,"hidden":false,"merged":[]}
[]
[null,null,"Jar Settings HELP Screen"]
[null,null,"Step 1 - Determine rapid mix time based on available rapid mix volume and flow rate through rapid mix.  To determine the mixing"]
[null,null,"energy (G value), use plant design info or refer to HELP buttons for type of mixing."]
[null,null,null,"Enter square jar volume (1 or 2)",2,"Liters"]
[null,null,null,"1 or 2 Liter"]
[null,null,"Stage","1st","2nd","3rd",null,null,null,null,null,"When G value exceeds G achievable by jar @ 300 rpm, equivalent G x t can be used to add mixing time."]
[null,null,"Rapid Mix Volume (ft3)",104,451,204]
[null,null,"Rapid Mix Flow Rate (MGD)",3.74,3.74,{"$f":"3.74/2","v":1.87},null,null,null,null,null,null,"Full Scale","Jar @ 300 rpm"]
[null,null,"Mix Time (sec)",{"$f":"IF(D9=\"\",\"CALCULATION\",D8*7.48*1440*60/D9/1000000)","v":17.9712},{"$f":"IF(E9=\"\",\"CALCULATION\",E8*7.48*1440*60/E9/1000000)","v":77.9328},{"$f":"IF(F9=\"\",\"CALCULATION\",F8*7.48*1440*60/F9/1000000)","v":70.502399999999994},null,null,null,null,null,"Time, sec",null,{"$f":"IF(N11=\"\",\"CALC\",M12/N11)","v":"CALC"}]
{"$rows_left_out":83}
{"sheet":"HydraulicMixHELP","index":9,"n_rows":81,"n_cols":11,"rows_kept":81,"cut":false,"hidden":false,"merged":[]}
[null,"Calculation of Velocity Gradient (G) for Hydraulic Mixing"]
[]
[null,"Parameters","Input","Input","Input","Units"]
[null,"Description","Channel RM","Pipe RM"]
[null,"Basin/Pipe Volume",104,204,null,"ft3"]
[null,"Flow Rate",2.2999999999999998,{"$f":"2.3/2","v":1.1499999999999999},null,"MGD"]
[null,"Head loss (hL)",7.0000000000000001E-3,2.12E-2,null,"ft",null,"  Note: Headloss through piping segments can be estimated"]
[null,"Weight of Fluid (w)",62.4,62.4,62.4,"lb/ft3"]
[null,"Water Temperature",{"$f":"DataEntry!E6","v":0},{"$f":"C9","v":0},{"$f":"C9","v":0},"C"]
[null,"Dynamic viscosity (u)",{"$f":"1.3391*10^-8*C9^2-1.0818*10^-6*C9+3.7125*10^-5","v":3.7125000000000001E-5},{"$f":"C10","v":3.7125000000000001E-5},{"$f":"C10","v":3.7125000000000001E-5},"lb-sec/ft2"]
{"$rows_left_out":72}
{"sheet":"NozzleMixHELP","index":10,"n_rows":36,"n_cols":14,"rows_kept":36,"cut":false,"hidden":false,"merged":[[20,4,20,14],[21,4,35,9]]}
[null,"Calculation of Velocity Gradient (G) for Pump Injection thru Nozzle"]
[]
[null,"Parameters","Input",null,"Units"]
[null,"Description"]
[null,"Coefficient of discharge",null,null,null,0.85,"Obtained from Tacoma jar test speadsheet"]
[null,"Area of nozzle(s)",null,null,"ft2"]
[null,"Flow rate through nozzle(s)",null,null,"gpm"]
[null,"Diameter of pipeline or area of flow",null,null,"ft2"]
[null,"Jet velocity",null,null,"ft/sec",{"$f":"F8*72","v":0},"ft^2 area for 72 nozzles"]
[null,"Water horsepower",null,null,"Hp"]
{"$rows_left_out":27}
{"sheet":"TurbineMixHELP","index":11,"n_rows":111,"n_cols":7,"rows_kept":111,"cut":false,"hidden":false,"merged":[[9,1,9,2],[12,1,12,2],[2,1,2,2],[4,1,4,2],[5,1,5,2],[6,1,6,2],[3,1,3,2],[63,1,63,2],[65,1,65,2],[66,1,66,2],[67,1,67,2],[70,1,70,2],[73,1,73,2],[64,1,64,2],[98,1,98,2],[88,1,88,2],[89,1,89,2],[90,1,90,2],[91,1,91,2],[92,1,92,2],[95,1,95,2]]}
[null,"Calculation of Velocity Gradient (G) for Vertical Turbine Mixers"]
[]
[null,"Parameters",null,"Input","Units","Note:"]
[null,"Description",null,"Rapid Mix Basin",null,"Input current water temperature in the DataEntry screen - the"]
[null,"Blade Diameter (D)",null,3.1,"ft","velocity gradient calculation requires a current value to be accurate."]
[null,"Impeller Number (Np)",null,1.6,"See Below"]
[null,"Volume (V)",null,451,"ft3"]
[null,"Weight of Fluid (w)",null,62.4,"lb/ft3"]
[null,"Acceleration of Gravity",null,32.200000000000003,"ft/sec2"]
[null,"Water Temperature",null,{"$f":"DataEntry!E6","v":0},"C"]
{"$rows_left_out":102}
{"sheet":"PaddleMixHELP","index":12,"n_rows":97,"n_cols":7,"rows_kept":97,"cut":false,"hidden":false,"merged":[]}
[null,"Calculation of Velocity Gradient (G) for Paddle-Type Mixers"]
[]
[null,null,"Parameters","Input","Units","NOTE:"]
[null,null,"Description","1st stage flocculation",null,"Input current water temperature in the DataEntry Screen - the"]
[null,null,"Coefficient of Drag (Cd)",1.8,null,"velocity gradient calculation requires a current value to be accurate."]
[null,null,"Area of Paddles (A)",null,"ft2"]
[null,null,"Diameter of Flocculator (d)",null,"ft"]
[null,null,"Volume of basin (V)",null,"ft3"]
[null,null,"Water Temperature",{"$f":"DataEntry!E6","v":0},"C"]
[null,null,"u",{"$f":"1.3391*10^-8*D9^2-1.0818*10^-6*D9+3.7125*10^-5","v":3.7125000000000001E-5},"lb-sec/ft2 @ 40F"]
{"$rows_left_out":88}
{"sheet":"BeamMixHELP","index":13,"n_rows":33,"n_cols":6,"rows_kept":33,"cut":false,"hidden":false,"merged":[]}
[null,null,"Calculation of Velocity Gradient (G) for Walking Beam Mixers"]
[]
[]
[null,null,"Parameters","Input","Units","NOTE:"]
[null,null,"Coefficient of Drag (Cd)",3,null,"Input current water temperature in the DataEntry screen - the"]
[null,null,"Area of Paddles (A)",null,"ft2","velocity gradient calculation requires a current value to be accurate."]
[null,null,"Paddle Stroke Length (L)",null,"ft"]
[null,null,"Volume of basin (V)",null,"ft3"]
[null,null,"Water Temperature",{"$f":"DataEntry!E6","v":0},"C"]
[null,null,"u",{"$f":"1.3391*10^-8*D9^2-1.0818*10^-6*D9+3.7125*10^-5","v":3.7125000000000001E-5},"lb-sec/ft2 @ 40F"]
{"$rows_left_out":24}
{"sheet":"Database","index":14,"n_rows":10,"n_cols":97,"rows_kept":10,"cut":false,"hidden":false,"merged":[]}
["Date &",null,null,null,null,null,null,null,null,null,null,null,null,"Current","Other","Current Dose","Other","Current Dose",null,null,null,"Rapid Mix","Rapid Mix","Rapid Mix","Rapid Mix","Floc","Floc","Floc","Floc","Floc","Floc",null,"Stock Solution Concentration",null,null,"Raw Water","Jar 1","Jar 1","Jar 1","Jar 1","Jar 1","Jar 1","Jar 1","Jar 1","Jar 1","Jar 1","Jar 2","Jar 2","Jar 2","Jar 2","Jar 2","Jar 2","Jar 2","Jar 2","Jar 2","Jar 2","Jar 3","Jar 3","Jar 3","Jar 3","Jar 3","Jar 3","Jar 3","Jar 3","Jar 3","Jar 3","Jar 4","Jar 4","Jar 4","Jar 4","Jar 4","Jar 4","Jar 4","Jar 4","Jar 4","Jar 4","Jar 5","Jar 5","Jar 5","Jar 5","Jar 5","Jar 5","Jar 5","Jar 5","Jar 5","Jar 5","Jar 6","Jar 6","Jar 6","Jar 6","Jar 6","Jar 6","Jar 6","Jar 6","Jar 6","Jar 6"]
["Sample No.",null,"Plant/Train","Water","Test","Test","Raw","Water","Water","Raw","Raw","Raw","Coagulant","Dose","Chemical 1","Other","Chemical 2","Other","Settled","IFE","Finished","Speed","Time","Speed","Time","Stage 1","Stage 1","Stage 2","Stage 2","Stage 3","Stage 3","Settle","Coagulant","Other","Other","Added to","Coagulant","Other Chem 1","Other Chem 2","Time to Floc","Floc","Settled","Settled","Filtered","Settled","Settled","Coagulant","Other Chem 1","Other Chem 2","Time to Floc","Floc","Settled","Settled","Filtered","Settled","Settled","Coagulant","Other Chem 1","Other Chem 2","Time to Floc","Floc","Settled","Settled","Filtered","Settled","Settled","Coagulant","Other Chem 1","Other Chem 2","Time to Floc","Floc","Settled","Settled","Filtered","Settled","Settled","Coagulant","Other Chem 1","Other Chem 2","Time to Floc","Floc","Settled","Settled","Filtered","Settled","Settled","Coagulant","Other Chem 1","Other Chem 2","Time to","Floc","Settled","Settled","Filtered","Settled","Settled","Last"]
[43678,"Date","Name","Source","No.","Time","Turbidity","Temperature","Flow","pH","TOC","Alkalinity","Name","Coagulant","Name","Chemical 1","Name","Chemical 2","Turbidity","Turbidity","TOC","#1","#1","#2","#2","Speed","Time","Speed","Time","Speed","Time","Time",null,"Chemical 1","Chemical 2","Jars","Dose","Dose","Dose","Formation","Size","Turb","pH","Turb","TOC","UV absorb","Dose","Dose","Dose","Formation","Size","Turb","pH","Turb","TOC","UV absorb","Dose","Dose","Dose","Formation","Size","Turb","pH","Turb","TOC","UV absorb","Dose","Dose","Dose","Formation","Size","Turb","pH","Turb","TOC","UV absorb","Dose","Dose","Dose","Formation","Size","Turb","pH","Turb","TOC","UV absorb","Dose","Dose","Dose","Floc","Size","Turb","pH","Turb","TOC","UV absorb","Column"]
["#","m/d/y",null,null,"#","hr:min","NTU","C","MGD","units","mg/L","mg/L",null,null,null,null,null,null,null,null,null,"RPM","min","RPM","min","RPM","min","RPM","min","RPM","min","min","%","%","%","mL","mg/L","mg/L","mg/L","min","mm","NTU","units","NTU","mg/L","cm-1","mg/L","mg/L","mg/L","min","mm","NTU","units","NTU","mg/L","cm-1","mg/L","mg/L","mg/L","min","mm","NTU","units","NTU","mg/L","cm-1","mg/L","mg/L","mg/L","min","mm","NTU","units","NTU","mg/L","cm-1","mg/L","mg/L","mg/L","min","mm","NTU","units","NTU","mg/L","cm-1","mg/L","mg/L","mg/L","min","mm","NTU","units","NTU","mg/L","cm-1"]
[1,2,3,4,5,6,7,8,9,10,11,12,13,14,15,16,17,18,19,20,21,22,23,24,25,26,27,28,29,30,31,32,33,34,35,36,37,38,39,40,41,42,43,44,45,46,47,48,49,50,51,52,53,54,55,56,57,58,59,60,61,62,63,64,65,66,67,68,69,70,71,72,73,74,75,76,77,78,79,80,81,82,83,84,85,86,87,88,89,90,91,92,93,94,95,96,97]
[37044.01,"2001-06-02","Example","Wilson Lake",1,"09:00:00",6,15,7,7.4,4,65,"Alum",20,"Cat Floc",1,"Nalco 8109",0.05,2,0.15,2.2000000000000002,100,60,null,null,40,15,30,15,15,15,10,null,null,null,null,10,2.5,0.05,4,0.5,4,7.3,0.15,3.8,7.0000000000000007E-2,20,3,0.1,3,0.5,3.8,7.2,0.14000000000000001,3.7,6.5000000000000002E-2,30,3.5,0.15,2,1,3.5,7.1,0.13,3.5,0.06,40,4,0.2,1,2,3,7,0.12,3.3,5.5E-2,50,4.5,0.25,1,2,2.8,6.9,0.1,3.2,0.05,60,5,0.3,1,2,3.5,6.8,0.14000000000000001,3,0.04]
[37559.01,"2002-10-30","Thibodaux WTP","Bayou Lafourche",1,"02:00:00",53,23.7,1.44,7,7.7,72,"Alum",null,null,null,null,null,null,null,null,5,100,null,null,40,25,null,null,null,null,10,2,null,null,2000,null,null,null,null,null,47.1,6.85,null,null,null,20,null,null,10,null,45.8,6.85,null,null,null,40,null,null,2,null,14.4,6.75,null,null,null,60,null,null,2,null,1.38,6.67,null,null,null,80,null,null,2,null,1.74,6.57,null,null,null,100,null,null,2,null,2.06,6.49]
[37685.01,"2003-03-05","Winchester WTP","Kentucky River",1,"15:00:00",9.9,6,2.5,7.7,null,122,"Thermafloc",null,null,null,null,null,null,null,null,80,100,null,null,52,14,15,14,null,null,15,2,null,null,2000,10,null,null,null,null,10.199999999999999,7.35,null,null,7.5499999999999998E-2,20,null,null,null,null,4.2,7.15,null,null,6.4000000000000001E-2,30,null,null,null,null,3,7.19,null,null,5.8000000000000003E-2,40,null,null,null,null,3.2,7.16,null,null,5.2999999999999999E-2,50,null,null,null,null,0.8,7.29,null,null,5.1999999999999998E-2,60,null,null,null,null,1.45,7.12,null,null,4.4499999999999998E-2]
[38477.01,"2005-05-05","Algiers WTP","Mississippi River",1,"00:00:00",null,20,10,null,null,null,"Ferric Sulfate",7.25,"Magnafloc",6.9,"Lime",55,null,null,null,47,33,118,2,45,44,null,null,null,null,null,0.15,0.15,1.5,1500,null,6.9,55,null,null,null,null,null,null,null,3,6.9,55,null,null,null,null,null,null,null,6,6.9,55,null,null,null,null,null,null,null,7.25,6.9,55,null,null,null,null,null,null,null,9,6.9,55,null,null,null,null,null,null,null,12,6.9,55]
[43678,"2019-08-01","Ottawa, KS",null,null,"00:00:00",6.5,26.2,3.7440000000000002,7.7]